{"text_format":"1","workbook":"xlsx","n_sheets":3,"sheets":["Notes Balance","Cumulative Defaults","Collateral Tables"],"not_rendered":{"charts":1,"images":0,"macros":1,"external_links":7,"defined_names":24,"comments":2,"pivot_tables":0},"unopened":[],"bounds":{"document_bytes":16777216,"sheet_cells":100000,"rows_first":2000,"rows_last":500,"rows_between":2000,"halvings":0,"cell_chars":16384,"cell_head_chars":4096},"cells_cut":0,"cells_raw":0,"read":"whole","date_system":"1900"}

{"sheet":"Notes Balance","index":0,"n_rows":42,"n_cols":6,"rows_kept":42,"cut":false,"hidden":false,"merged":[]}
["TOTAL NOTE BALANCES"]
[null,"Total Notes","Class A Notes","Class A2 Notes","Class B Notes","Class C Notes"]
["Initial Invested Amount",{"$f":"SUM(C3:G3)","v":507600000},483300000,0,13500000,10800000]
["Invested Amount as at Previous Payment Date:  17 May 2021",{"$f":"SUM(C4:G4)","v":507600000},483300000,0,13500000,10800000]
["Stated Amount as at Previous Payment Date:  17 May 2021",507600000,483300000,0,13500000,10800000]
["Principal Payments to Noteholders on Payment Date",68701598.230000004,68701598.230000004,0,0,0]
["Gross Aggregate Charge-Offs",0,0,0,0,0]
["Gross Aggregate Reinstatements of charge-offs",0,0,0,0,0]
["Aggregate Charge-Offs for this Collection Period",0,0,0,0,0]
["Reinstatements relating to Charge-offs that have occurred this Collection Period",{"$f":"SUM(C10:G10)","v":0},0,0,0,0]
["Aggregate Carry Over Charge-offs not previously reinstated",0,0,0,0,0]
["Reinstatements of Carry Over Charge-offs not previously reinstated",0,0,0,0,0]
["Aggregate Charge-Offs not reinstated and to be carried over to next period",0,0,0,0,0]
["Invested Amount as at Payment Date:  16 August 2021",438898401.76999998,414598401.76999998,0,13500000,10800000]
["Stated Amount as at Payment Date:  16 August 2021",438898401.76999998,414598401.76999998,0,13500000,10800000]
["Bond Factor at Payment Date:  16 August 2021",null,0.8578489587626732,0,1,1]
["Coupon Margin",null,7.0000000000000001E-3,0,0,0]
["Coupon Rate (3 month BBSW + margin)",null,7.3940000000000004E-3,3.9399999999999998E-4,3.9399999999999998E-4,3.9399999999999998E-4]
["Days in Coupon Period",null,91,91,91,91]
["Coupon Entitlement to be paid out on the current Payment Date: 16 August 2021",null,890932.43,0,1326.11,1060.8900000000001]
[]
[]
["TOTAL NOTE BALANCES"]
[null,"Total Notes","Class A Notes","Class A2 Notes","Class B Notes","Class C Notes"]
["Initial Invested Amount",{"$f":"+SUM(C25:F25)","v":507600000},483300000,0,13500000,10800000]
["Invested Amount as at Previous Payment Date:  16 August 2021",{"$f":"+SUM(C26:F26)","v":438898401.76999998},414598401.76999998,0,13500000,10800000]
["Stated Amount as at Previous Payment Date:  16 August 2021",438898401.76999998,414598401.76999998,0,13500000,10800000]
["Principal Payments to Noteholders on Payment Date",28325836.690000001,28325836.690000001,0,0,0]
["Gross Aggregate Charge-Offs",0,0,0,0,0]
["Gross Aggregate Reinstatements of charge-offs",0,0,0,0,0]
["Aggregate Charge-Offs for this Collection Period",0,0,0,0,0]
["Reinstatements relating to Charge-offs that have occurred this Collection Period",0,0,0,0,0]
["Aggregate Carry Over Charge-offs not previously reinstated",0,0,0,0,0]
["Reinstatements of Carry Over Charge-offs not previously reinstated",0,0,0,0,0]
["Aggregate Charge-Offs not reinstated and to be carried over to next period",0,0,0,0,0]
["Invested Amount as at Payment Date:  16 November 2021",410572565.07999998,386272565.07999998,0,13500000,10800000]
["Stated Amount as at Payment Date:  16 November 2021",410572565.07999998,386272565.07999998,0,13500000,10800000]
["Bond Factor at Payment Date:  16 November 2021",null,0.7992397373887854,0,1,1]
["Coupon Margin",null,7.0000000000000001E-3,0,0,0]
["Coupon Rate (3 month BBSW + margin)",null,7.1570000000000002E-3,1.5699999999999999E-4,1.5699999999999999E-4,1.5699999999999999E-4]
["Days in Coupon Period",null,92,92,92,92]
["Coupon Entitlement to be paid out on the current Payment Date: 16 November 2021",null,747917.34,0,534.23,427.38]

{"sheet":"Cumulative Defaults","index":1,"n_rows":5,"n_cols":4,"rows_kept":5,"cut":false,"hidden":false,"merged":[]}
["Cumulative Defaults & Losses"]
[]
["Month","Gross Losses","Recoveries","Net Losses"]
["2021-07-01",{"$f":"+'Collateral Tables'!I9/540000000","v":0},{"$f":"'Collateral Tables'!I23/540000000","v":0},{"$f":"+B4-C4","v":0}]
["2021-10-01",{"$f":"+'Collateral Tables'!E9/540000000","v":0},{"$f":"+'Collateral Tables'!E23/540000000","v":0},{"$f":"+B5-C5","v":0}]

{"sheet":"Collateral Tables","index":2,"n_rows":255,"n_cols":11,"rows_kept":255,"cut":false,"hidden":false,"merged":[]}
[null,"CNHI CAPITAL AUSTRALIA RECEIVABLES TRUST SERIES 2021-1 (TERM DEAL)"]
[null,"COLLATERAL DATA TABLES"]
[]
[null,"OUTSTANDING RECEIVABLES",null,null,"2021-10-31",null,null,null,"2021-07-31"]
[]
[null,"Opening Balance",null,null,{"$f":"'[1]16 Nov 21'!M163","v":471298401.76999968},null,null,null,539999974.61999965]
[null,"Principal Repayments - Scheduled",null,null,{"$f":"MIN(([2]Sheet1!$B$3+[3]Sheet1!$B$3+[4]Sheet1!$B$3),'[1]16 Nov 21'!H23)","v":21375090.149999995},null,null,null,59422745.440000013]
[null,"Principal Repayments - Unscheduled",null,null,{"$f":"'[1]16 Nov 21'!H23-'Collateral Tables'!E7","v":6950746.540000014},null,null,null,9278827.4099999517]
[{"$f":"SUM(E9:I9)","v":0},"Charge-Offs",null,null,{"$f":"'[1]16 Nov 21'!D37","v":0},null,null,null,0]
[null,"Reinstatements"]
[null,"New Receivables Purchased"]
[null,"Non Cash Change in Receivables"]
[null,"Closing Balance",null,null,{"$f":"E6-E7-E8-E9+E10+E11-E12","v":442972565.07999969},null,null,null,471298401.76999968]
[]
[null,"PORTFOLIO STATISTICS"]
[]
[null,"Summary"]
[null,"Number of contracts",null,null,{"$f":"[5]Summary!$B$4","v":4503},null,null,null,4717]
[null,"Dollar value of contracts",null,null,{"$f":"[5]Summary!$B$5","v":442972565.0799998},null,null,null,471298401.76999849]
[null,"Number of contracts closed during the Quarter",null,null,{"$f":"[5]Summary!$B$19","v":214},null,null,null,227]
[null,"Dollar value of contracts closed during the Quarter",null,null,{"$f":"[5]Summary!$B$20","v":9889285.4700000044},null,null,null,15873333.849999998]
[]
[{"$f":"SUM(E23:I23)","v":0},"Dollar Value of Recoveries from Collateral",null,null,{"$f":"[5]Summary!$C$16","v":0},null,null,null,0]
[{"$f":"SUM(E24:I24)","v":0},"Dollar Value of Recoveries from Other Sources",null,null,0,null,null,null,0]
[]
[null,"Average Term of Contracts (Months)",null,null,{"$f":"[6]Sheet1!$W$4505","v":54.72447090070245},null,null,null,54.491598918116452]
[null,"Average Term to Maturity (Months)",null,null,{"$f":"[6]Sheet1!$X$4505","v":37.45208747599041},null,null,null,39.996367531539505]
[null,"Average Residual / Balloon Payment *",null,null,{"$f":"[6]Sheet1!$AI$4505","v":4.6197075252970211E-2},null,null,null,4.7495394520798505E-2]
[null,"Average Seasoning (Months)",null,null,{"$f":"E26-E27","v":17.272383424712039},null,null,null,14.495231386576947]
[null,"Average Dollar Value of Individual Assets",null,null,{"$f":"E19/E18","v":98372.765951587789},null,null,null,99914.861515793615]
[null,"Weighted Average Interest Rate",null,null,{"$f":"[6]Sheet1!$AA$4505/100","v":2.1890989732123292E-2},null,null,null,2.1995904554703908E-2]
[]
[null,"Payment in Arrears"]
["1. 0 - 30 Days","0 - 30 Days",null,null,{"$f":"IFERROR(VLOOKUP($A34,'[7]Arrears Reporting'!$A$1:$D$8,3,FALSE),0)","v":4496},{"$f":"IFERROR(VLOOKUP($A34,'[7]Arrears Reporting'!$A$1:$D$8,2,FALSE),0)","v":110119.20999999996},{"$f":"F34/F$50","v":2.4859149003982376E-4},null,4712,195906.98,4.1567503574010831E-4]
["2. 31 - 60 Days","31 - 60 Days",null,null,{"$f":"IFERROR(VLOOKUP($A35,'[7]Arrears Reporting'!$A$1:$D$8,3,FALSE),0)","v":5},{"$f":"IFERROR(VLOOKUP($A35,'[7]Arrears Reporting'!$A$1:$D$8,2,FALSE),0)","v":253453.39999999997},5.7216500519445687E-4,null,4,147584.37,3.1314421913109658E-4]
["3. 61 - 90 Days","61 - 90 Days",null,null,{"$f":"IFERROR(VLOOKUP($A36,'[7]Arrears Reporting'!$A$1:$D$8,3,FALSE),0)","v":0},{"$f":"IFERROR(VLOOKUP($A36,'[7]Arrears Reporting'!$A$1:$D$8,2,FALSE),0)","v":0},0,null,1,20086.370000000003,4.2619219425663342E-5]
["4. 91 - 120 Days","91 - 120 Days",null,null,{"$f":"IFERROR(VLOOKUP($A37,'[7]Arrears Reporting'!$A$1:$D$8,3,FALSE),0)","v":1},{"$f":"IFERROR(VLOOKUP($A37,'[7]Arrears Reporting'!$A$1:$D$8,2,FALSE),0)","v":14297.29},3.2275791159702955E-5,null,0,0,0]
["5. 121 - 150 Days","121 - 150 Days",null,null,{"$f":"IFERROR(VLOOKUP($A38,'[7]Arrears Reporting'!$A$1:$D$8,3,FALSE),0)","v":1},{"$f":"IFERROR(VLOOKUP($A38,'[7]Arrears Reporting'!$A$1:$D$8,2,FALSE),0)","v":96095.999999999985},2.1693442794283496E-4,null,0,0,0]
["6. 151 - 180 Days","151 - 180 Days",null,null,{"$f":"IFERROR(VLOOKUP($A39,'[7]Arrears Reporting'!$A$1:$D$8,3,FALSE),0)","v":0},{"$f":"IFERROR(VLOOKUP($A39,'[7]Arrears Reporting'!$A$1:$D$8,2,FALSE),0)","v":0},0,null,0,0,0]
[null,"Total",null,null,{"$f":"SUM(E34:E39)","v":4503},{"$f":"SUM(F34:F39)","v":473965.89999999991},{"$f":"SUM(G34:G39)","v":1.0699667143368185E-3},null,4717,363577.72,7.7143847429686821E-4]
[null,"* Expressed as a % of Aggreg. Rec. closing bal.",null,null,null,"> 30 days",{"$f":"SUM(G35:G39)","v":8.2137522429699477E-4},null,null,"> 30 days",3.5576343855675991E-4]
[]
[" 0 - 30 Days","Account Balances in Arrears"]
["1. 0 - 30 Days","0 - 30 Days",null,null,{"$f":"IFERROR(VLOOKUP($A44,'[7]Arrears Reporting'!$A$1:$D$8,3,FALSE),0)","v":4496},{"$f":"IFERROR(VLOOKUP($A44,'[7]Arrears Reporting'!$A$1:$D$8,4,FALSE),0)","v":441358176.30999982},{"$f":"F44/F$50","v":0.99635555585771229},null,4712,470790435.33999842,0.99892219785152614]
["2. 31 - 60 Days","31 - 60 Days",null,null,{"$f":"IFERROR(VLOOKUP($A45,'[7]Arrears Reporting'!$A$1:$D$8,3,FALSE),0)","v":5},{"$f":"IFERROR(VLOOKUP($A45,'[7]Arrears Reporting'!$A$1:$D$8,4,FALSE),0)","v":1388190.9000000001},{"$f":"F45/F$50","v":3.1338078459764119E-3},null,4,272648.59999999998,5.7850525055049321E-4]
["3. 61 - 90 Days","61 - 90 Days",null,null,{"$f":"IFERROR(VLOOKUP($A46,'[7]Arrears Reporting'!$A$1:$D$8,3,FALSE),0)","v":0},{"$f":"IFERROR(VLOOKUP($A46,'[7]Arrears Reporting'!$A$1:$D$8,4,FALSE),0)","v":0},0,null,1,235317.83,4.9929689792336499E-4]
["4. 91 - 120 Days","91 - 120 Days",null,null,{"$f":"IFERROR(VLOOKUP($A47,'[7]Arrears Reporting'!$A$1:$D$8,3,FALSE),0)","v":1},{"$f":"IFERROR(VLOOKUP($A47,'[7]Arrears Reporting'!$A$1:$D$8,4,FALSE),0)","v":135254.64000000001},{"$f":"F47/F$50","v":3.0533412374098912E-4},null,0,0,0]
["5. 121 - 150 Days","121 - 150 Days",null,null,{"$f":"IFERROR(VLOOKUP($A48,'[7]Arrears Reporting'!$A$1:$D$8,3,FALSE),0)","v":1},{"$f":"IFERROR(VLOOKUP($A48,'[7]Arrears Reporting'!$A$1:$D$8,4,FALSE),0)","v":90943.23},{"$f":"F48/F$50","v":2.053021725703845E-4},null,0,0,0]
["6. 151 - 180 Days","151 - 180 Days",null,null,{"$f":"IFERROR(VLOOKUP($A49,'[7]Arrears Reporting'!$A$1:$D$8,3,FALSE),0)","v":0},{"$f":"IFERROR(VLOOKUP($A49,'[7]Arrears Reporting'!$A$1:$D$8,4,FALSE),0)","v":0},{"$f":"F49/F$50","v":0},null,0,0,0]
[null,"Total",null,null,{"$f":"SUM(E44:E49)","v":4503},{"$f":"SUM(F44:F49)","v":442972565.0799998},{"$f":"SUM(G44:G49)","v":1},null,4717,471298401.76999843,1]
["NSW",null,null,null,null,"> 30 days",{"$f":"SUM(G45:G49)","v":3.6444441422877859E-3},null,null,"> 30 days",1.0778021484738583E-3]
[null,null,null,null,null,"> 60 days",{"$f":"SUM(G46:G49)","v":5.1063629631137363E-4},null,null,"> 60 days",4.9929689792336499E-4]
[null,null,null,null,null,">90 days",{"$f":"SUM(G47:G49)","v":5.1063629631137363E-4},null,null,">90 days",0]
[]
["VIC","Geographic Distribution"]
["NSW","New South Wales",null,null,{"$f":"F56/F$64","v":0.33118214877146057},{"$f":"IFERROR(VLOOKUP($A56,'[7]Geographic '!$A$1:$C$10,3,FALSE),0)","v":146704605.95000011},null,null,0.33103569692591123,156016594.89000008]
["VIC","Victoria",null,null,{"$f":"F57/F$64","v":0.21139368986223459},{"$f":"IFERROR(VLOOKUP($A57,'[7]Geographic '!$A$1:$C$10,3,FALSE),0)","v":93641605.040000081},null,null,0.21226914626547361,100042109.38000008]
["QLD","Queensland",null,null,0.10124455450621518,{"$f":"IFERROR(VLOOKUP($A58,'[7]Geographic '!$A$1:$C$10,3,FALSE),0)","v":44848560.010000028},null,null,0.10435840061261739,49183947.419999972]
["SA","South Australia",null,null,0.15665609775961517,{"$f":"IFERROR(VLOOKUP($A59,'[7]Geographic '!$A$1:$C$10,3,FALSE),0)","v":69394353.459999993},null,null,0.15537976293782821,73230233.939999923]
["NT","Northern Territory",null,null,1.6321954382647244E-4,{"$f":"IFERROR(VLOOKUP($A60,'[7]Geographic '!$A$1:$C$10,3,FALSE),0)","v":72301.78},null,null,1.5340977123721341E-4,72301.78]
["ACT","Australian Capital Territory",null,null,2.1870392804688407E-4,{"$f":"IFERROR(VLOOKUP($A61,'[7]Geographic '!$A$1:$C$10,3,FALSE),0)","v":96879.840000000026},null,null,2.0555944946165698E-4,96879.840000000026]
["TAS","Tasmania",null,null,1.7017469690563346E-2,{"$f":"IFERROR(VLOOKUP($A62,'[7]Geographic '!$A$1:$C$10,3,FALSE),0)","v":7538272.200000002},null,null,1.8092037354629446E-2,8526748.2899999972]
["WA","Western Australia",null,null,0.18212411593803798,{"$f":"IFERROR(VLOOKUP($A63,'[7]Geographic '!$A$1:$C$10,3,FALSE),0)","v":80675986.800000027},null,null,0.17850598668284129,84129586.230000004]
[null,"Total",null,null,{"$f":"SUM(E56:E63)","v":1.0000000000000002},{"$f":"SUM(F56:F63)","v":442972565.08000016},null,null,1,471298401.77000004]
["AG",null,null,null,null,null,{"$f":"E13-F64","v":-4.76837158203125E-7},null,null,null,0]
["CE","Top Industry Distribution"]
["AGRICULTURAL MACHINERY","Agricultural",null,null,{"$f":"F67/F$70","v":0.9491182301415676},{"$f":"IFERROR(VLOOKUP($A$67,'[7]Top Industry'!$A$1:$C$4,3,FALSE),)","v":420433336.96999979},null,null,0.94569648368447079,445705241.3199988]
["CONSTRUCTION EQUIPMENT","Construction",null,null,{"$f":"F68/F$70","v":5.0881769858432353E-2},{"$f":"IFERROR(VLOOKUP($A$68,'[7]Top Industry'!$A$1:$C$4,3,FALSE),)","v":22539228.109999999},null,null,5.4303516315529272E-2,25593160.449999999]
["MOTOR VEHICLE - AG","Motor Vehicle AG",null,null,{"$f":"F69/F$70","v":0},{"$f":"IFERROR(VLOOKUP($A$69,'[7]Top Industry'!$A$1:$C$4,3,FALSE),)","v":0},null,null,0,0]
[null,"Total",null,null,{"$f":"SUM(E67:E69)","v":1},{"$f":"SUM(F67:F69)","v":442972565.0799998},{"$f":"F64-F70","v":0},null,1,471298401.76999879,1.2516975402832031E-6]
["COMBINE"]
["40-100 HP TRACTOR","Collateral Types"]
["100<140 HP TRACTOR","100<140 HP TRACTOR",null,null,{"$f":"IFERROR(F73/F$116,0)","v":0.10526080036486933},{"$f":"IFERROR(VLOOKUP($A73,[7]Collateral!$A$1:$C$43,3,FALSE),\"\")","v":46627646.739999965},null,null,0.10636572878612072,50129997.979999989]
["4 EWD TRACTORS","4 EWD TRACTORS",null,null,9.9431621306040607E-2,{"$f":"IFERROR(VLOOKUP($A74,[7]Collateral!$A$1:$C$43,3,FALSE),\"\")","v":44045480.339999989},null,null,9.6039692729722251E-2,45263353.689999998]
["40<60 HP TRACTOR","40<60 HP TRACTOR",null,null,1.3569863291453297E-2,{"$f":"IFERROR(VLOOKUP($A75,[7]Collateral!$A$1:$C$43,3,FALSE),\"\")","v":6011077.1499999985},null,null,1.4664640202562935E-2,6911421.4900000021]
["4WD Vehicle","4WD Vehicle",null,null,2.1459950004540812E-3,{"$f":"IFERROR(VLOOKUP($A76,[7]Collateral!$A$1:$C$43,3,FALSE),\"\")","v":950616.91},null,null,2.1102970353066635E-3,994579.62]
["60<100 HP TRACTOR","60<100 HP TRACTOR",null,null,4.401010635157325E-2,{"$f":"IFERROR(VLOOKUP($A77,[7]Collateral!$A$1:$C$43,3,FALSE),\"\")","v":19495269.700000003},null,null,4.5290810619843497E-2,21345486.659999989]
["BACKHOE","BACKHOE",null,null,6.4766462444053807E-4,{"$f":"IFERROR(VLOOKUP($A78,[7]Collateral!$A$1:$C$43,3,FALSE),\"\")","v":286897.65999999997},null,null,6.7775056906703142E-4,319422.75999999995]
["BALERS, WINDROWERS, MOWERS, RAKES","BALERS, WINDROWERS, MOWERS, RAKES",null,null,4.641457690791035E-2,{"$f":"IFERROR(VLOOKUP($A79,[7]Collateral!$A$1:$C$43,3,FALSE),\"\")","v":20560384.189999983},null,null,4.8041674414694008E-2,22641964.36999999]
["COMBINES","COMBINES",null,null,0.29205535906413432,{"$f":"IFERROR(VLOOKUP($A80,[7]Collateral!$A$1:$C$43,3,FALSE),\"\")","v":129372511.55000001},null,null,0.29169772327615578,137476670.77999997]
["COMPACT TRACK LOADER","COMPACT TRACK LOADER",null,null,6.0206096274119164E-3,{"$f":"IFERROR(VLOOKUP($A81,[7]Collateral!$A$1:$C$43,3,FALSE),\"\")","v":2666964.8899999997},null,null,6.7614079700510487E-3,3186640.77]
["COMPACT WHEEL LOADER","COMPACT WHEEL LOADER",null,null,1.1666414824283049E-3,{"$f":"IFERROR(VLOOKUP($A82,[7]Collateral!$A$1:$C$43,3,FALSE),\"\")","v":516790.16999999993},null,null,1.214799472796438E-3,572533.04999999993]
["COTTON PICKERS","COTTON PICKERS",null,null,1.4762766851755204E-3,{"$f":"IFERROR(VLOOKUP($A83,[7]Collateral!$A$1:$C$43,3,FALSE),\"\")","v":653950.06999999983},null,null,1.387549941913735E-3,653950.06999999983]
["CRAWLER EXCAVATOR","CRAWLER EXCAVATOR",null,null,1.4517343571466128E-2,{"$f":"IFERROR(VLOOKUP($A84,[7]Collateral!$A$1:$C$43,3,FALSE),\"\")","v":6430784.919999999},null,null,1.4749377281767987E-2,6951357.9400000004]
["CRAWLER  DOZER","CRAWLER  DOZER",null,null,9.0901349596510304E-4,{"$f":"IFERROR(VLOOKUP($A85,[7]Collateral!$A$1:$C$43,3,FALSE),\"\")","v":402668.03999999992},null,null,9.2942570642063802E-4,438036.85000000003]
["CULTIVATORS,SEEDERS, HARROWS","CULTIVATORS,SEEDERS, HARROWS",null,null,2.1544219218805259E-2,{"$f":"IFERROR(VLOOKUP($A86,[7]Collateral!$A$1:$C$43,3,FALSE),\"\")","v":9543498.0499999989},null,null,2.0775771322853805E-2,9791587.8199999984]
["DRILL","DRILL",null,null,2.8008966870802219E-3,{"$f":"IFERROR(VLOOKUP($A87,[7]Collateral!$A$1:$C$43,3,FALSE),\"\")","v":1240720.3899999999},null,null,2.6756069727038654E-3,1261009.29]
["DUMP TRUCKS","DUMP TRUCKS",null,null,0,{"$f":"IFERROR(VLOOKUP($A88,[7]Collateral!$A$1:$C$43,3,FALSE),\"\")","v":""},null,null,0,""]
["EXCAVATORS / GRADERS","EXCAVATORS / GRADERS",null,null,1.3621026392255953E-4,{"$f":"IFERROR(VLOOKUP($A89,[7]Collateral!$A$1:$C$43,3,FALSE),\"\")","v":60337.409999999974},null,null,3.8207468840065635E-4,180071.19000000012]
["FEEDERS, MIXERS, WAGONS, BINS, FEED STORAGE","FEEDERS, MIXERS, WAGONS, BINS, FEED STORAGE",null,null,3.7928676004947851E-3,{"$f":"IFERROR(VLOOKUP($A90,[7]Collateral!$A$1:$C$43,3,FALSE),\"\")","v":1680136.2899999996},null,null,3.7479038616855254E-3,1766381.0999999996]
["FRONT END LOADER","FRONT END LOADER",null,null,4.93966437764566E-4,{"$f":"IFERROR(VLOOKUP($A91,[7]Collateral!$A$1:$C$43,3,FALSE),\"\")","v":218813.58},null,null,5.4164463329663104E-4,255276.25]
["FRONTS","FRONTS",null,null,5.127360200263895E-3,{"$f":"IFERROR(VLOOKUP($A92,[7]Collateral!$A$1:$C$43,3,FALSE),\"\")","v":2271279.9},null,null,4.9665274934293149E-3,2340716.4700000007]
["GRADER","GRADER",null,null,1.7910154996996679E-3,{"$f":"IFERROR(VLOOKUP($A93,[7]Collateral!$A$1:$C$43,3,FALSE),\"\")","v":793370.72999999986},null,null,1.8662446057460555E-3,879558.09999999986]
["HARVESTERS - Other","HARVESTERS - Other",null,null,1.2374488155965237E-2,{"$f":"IFERROR(VLOOKUP($A94,[7]Collateral!$A$1:$C$43,3,FALSE),\"\")","v":5481558.7599999998},null,null,1.2703868626573207E-2,5987312.9799999986]
["IRRIGATION EQUIPMENT","IRRIGATION EQUIPMENT",null,null,7.3387170138017527E-4,{"$f":"IFERROR(VLOOKUP($A95,[7]Collateral!$A$1:$C$43,3,FALSE),\"\")","v":325085.03000000003},null,null,6.8976476215305707E-4,325085.03000000003]
["MATERIALS HANDLING EQUIPMENT","MATERIALS HANDLING EQUIPMENT",null,null,6.5382261302727443E-4,{"$f":"IFERROR(VLOOKUP($A96,[7]Collateral!$A$1:$C$43,3,FALSE),\"\")","v":289625.48},null,null,8.0445995270959068E-4,379140.68999999994]
["MIDI CRAWLER EXCAVATOR","MIDI CRAWLER EXCAVATOR",null,null,1.3622053769651028E-3,{"$f":"IFERROR(VLOOKUP($A97,[7]Collateral!$A$1:$C$43,3,FALSE),\"\")","v":603419.60999999987},null,null,1.7386493714440583E-3,819422.66999999993]
["MINI EXCAVATOR","MINI EXCAVATOR",null,null,3.9545820172489322E-3,{"$f":"IFERROR(VLOOKUP($A98,[7]Collateral!$A$1:$C$43,3,FALSE),\"\")","v":1751771.3400000003},null,null,4.1419469972076147E-3,1952092.9999999998]
["OTHER AG","OTHER AG",null,null,3.5445235524155724E-3,{"$f":"IFERROR(VLOOKUP($A99,[7]Collateral!$A$1:$C$43,3,FALSE),\"\")","v":1570126.69},null,null,4.3436494635070693E-3,2047155.05]
["OTHER CE","OTHER CE",null,null,1.5603587095177585E-4,{"$f":"IFERROR(VLOOKUP($A100,[7]Collateral!$A$1:$C$43,3,FALSE),\"\")","v":69119.61},null,null,1.5640248242550282E-4,73712.240000000005]
["OVER 140 HP TRACTOR","OVER 140 HP TRACTOR",null,null,0.20159087013407426,{"$f":"IFERROR(VLOOKUP($A101,[7]Collateral!$A$1:$C$43,3,FALSE),\"\")","v":89299224.840000033},null,null,0.19897082703404384,93774632.779999986]
["QUAD BIKES","QUAD BIKES",null,null,2.7999702414437379E-5,{"$f":"IFERROR(VLOOKUP($A102,[7]Collateral!$A$1:$C$43,3,FALSE),\"\")","v":12403.099999999995},null,null,2.9435491289380938E-5,13872.899999999996]
["ROLLER","ROLLER",null,null,5.5213520944763072E-4,{"$f":"IFERROR(VLOOKUP($A103,[7]Collateral!$A$1:$C$43,3,FALSE),\"\")","v":244580.75},null,null,5.4762674566835069E-4,258095.61]
["SCRAPERS","SCRAPERS",null,null,0,{"$f":"IFERROR(VLOOKUP($A104,[7]Collateral!$A$1:$C$43,3,FALSE),\"\")","v":""},null,null,0,""]
["SKID STEER LOADER","SKID STEER LOADER",null,null,1.066704128538217E-2,{"$f":"IFERROR(VLOOKUP($A105,[7]Collateral!$A$1:$C$43,3,FALSE),\"\")","v":4725206.6399999997},null,null,1.1440874337255656E-2,5392065.79]
["SKIDSTEER / UNILOADER","SKIDSTEER / UNILOADER",null,null,5.1252519432890401E-5,{"$f":"IFERROR(VLOOKUP($A106,[7]Collateral!$A$1:$C$43,3,FALSE),\"\")","v":22703.460000000006},null,null,1.8637175443439219E-4,87836.709999999963]
["Soundproof Generators","Soundproof Generators",null,null,2.5771505731824004E-5,{"$f":"IFERROR(VLOOKUP($A107,[7]Collateral!$A$1:$C$43,3,FALSE),\"\")","v":11416.070000000002},null,null,2.7366865560249395E-5,12897.96]
["SPRAYING EQUIPMENT","SPRAYING EQUIPMENT",null,null,8.2528698822234528E-2,{"$f":"IFERROR(VLOOKUP($A108,[7]Collateral!$A$1:$C$43,3,FALSE),\"\")","v":36557949.410000004},null,null,8.0359731536884638E-2,37873413.040000007]
["Sugar Cane Harvesters","Sugar Cane Harvesters",null,null,1.3651893766621524E-3,{"$f":"IFERROR(VLOOKUP($A109,[7]Collateral!$A$1:$C$43,3,FALSE),\"\")","v":604741.43999999994},null,null,1.4003896629424374E-3,660001.40999999992]
["Telehandlers","Telehandlers",null,null,6.0071792697126191E-3,{"$f":"IFERROR(VLOOKUP($A110,[7]Collateral!$A$1:$C$43,3,FALSE),\"\")","v":2661015.61},null,null,5.8723834827486788E-3,2767644.9499999993]
["TRAILER - on Farm","TRAILER - on Farm",null,null,5.0160059000464729E-4,{"$f":"IFERROR(VLOOKUP($A111,[7]Collateral!$A$1:$C$43,3,FALSE),\"\")","v":222195.3},null,null,5.3533775852507054E-4,252303.83000000002]
["TRUCK - on Farm","TRUCK - on Farm",null,null,1.1453932816547419E-4,{"$f":"IFERROR(VLOOKUP($A112,[7]Collateral!$A$1:$C$43,3,FALSE),\"\")","v":50737.779999999992},null,null,1.1955703602724734E-4,56347.039999999994]
["UNDER 40 HP TRACTORS","UNDER 40 HP TRACTORS",null,null,2.1795888867872279E-3,{"$f":"IFERROR(VLOOKUP($A113,[7]Collateral!$A$1:$C$43,3,FALSE),\"\")","v":965498.08000000007},null,null,2.3386006739269144E-3,1102178.76]
["WHEEL LOADERS","WHEEL LOADERS",null,null,8.226468267491651E-3,{"$f":"IFERROR(VLOOKUP($A114,[7]Collateral!$A$1:$C$43,3,FALSE),\"\")","v":3644099.75},null,null,8.4565833769684896E-3,3985574.2299999995]
["WHEEL LOADERS (OLD)","WHEEL LOADERS (OLD)",null,null,6.9728133150687694E-5,{"$f":"IFERROR(VLOOKUP($A115,[7]Collateral!$A$1:$C$43,3,FALSE),\"\")","v":30887.649999999907},null,null,2.4952100316561149E-4,117598.84999999983]
[null,"Total",null,null,{"$f":"SUM(E73:E114)","v":0.99993027186684935},{"$f":"SUM(F73:F115)","v":442972565.07999998},{"$f":"F70-F116","v":0},null,0.99975047899683434,471298401.7700001,-1.3113021850585938E-6]
["$ 0 - $25,000"]
["$ 25,001 to $50,000","Contract Balance Distribution"]
["$0 - $25,000","$ 0 - $25,000",null,null,{"$f":"IFERROR(F119/F$130,0)","v":3.5033566282366299E-2},{"$f":"IFERROR(VLOOKUP($A119,'[7] Balance Distribution'!$A$1:$C$17,3,FALSE),\"\")","v":15518908.720000001},null,null,3.3400737305453877E-2,15741714.110000027]
["$25,001 - $50,000","$ 25,001 to $50,000",null,null,{"$f":"IFERROR(F120/F$130,0)","v":8.6514498799894937E-2},{"$f":"IFERROR(VLOOKUP($A120,'[7] Balance Distribution'!$A$1:$C$17,3,FALSE),\"\")","v":38323549.450000048},null,null,8.5539954026141965E-2,40314843.619999982]
{"$rows_left_out":135}